日別アーカイブ: 2016年2月19日

マルウェア検出


マルウェアを検出して除去しました。

BrowserModifier:Win32/Diplugem

Multiplug: C:\ProgramData\gioknhkjhdkenicdgggckjfohfibkogp
Multiplug: C:\ProgramData\gioknhkjhdkenicdgggckjfohfibkogp\background.html
Multiplug: C:\ProgramData\gioknhkjhdkenicdgggckjfohfibkogp\content.js
Multiplug: C:\ProgramData\gioknhkjhdkenicdgggckjfohfibkogp\GsY.js
Multiplug: C:\ProgramData\gioknhkjhdkenicdgggckjfohfibkogp\lsdb.js
Multiplug: C:\ProgramData\gioknhkjhdkenicdgggckjfohfibkogp\manifest.json
Multiplug: C:\ProgramData\ibckoadhmobidmamoalihmlghcfienpc
Multiplug: C:\ProgramData\ibckoadhmobidmamoalihmlghcfienpc\background.html
Multiplug: C:\ProgramData\ibckoadhmobidmamoalihmlghcfienpc\content.js
Multiplug: C:\ProgramData\ibckoadhmobidmamoalihmlghcfienpc\lsdb.js
Multiplug: C:\ProgramData\ibckoadhmobidmamoalihmlghcfienpc\manifest.json
Multiplug: C:\ProgramData\ibckoadhmobidmamoalihmlghcfienpc\zBieF.js

Android AOSP


Building the System | Android Open Source Projectの手順に従って、Nexus 7 (Wi-Fi), nakasi (grouper)のビルドを行ったところ次のエラーが発生しました。

File “../base/android/jni_generator/jni_generator.py”, line 212, in ParseJavaPSignature
return ‘”%s”‘ % signature_line[signature_line.index(prefix) + len(prefix):]
ValueError: substring not found
make: *** [out/target/product/generic/obj/GYP/shared_intermediates/content/jni/HashSet_jni.h] Error 1
make: *** …
Traceback (most recent call last):
File “../base/android/jni_generator/jni_generator.py”, line 1527, in
sys.exit(main(sys.argv))
File “../base/android/jni_generator/jni_generator.py”, line 1518, in main
GenerateJNIHeader(input_file, output_file, options)
File “../base/android/jni_generator/jni_generator.py”, line 1401, in GenerateJNIHeader
jni_from_javap = JNIFromJavaP.CreateFromClass(input_file, options)
File “../base/android/jni_generator/jni_generator.py”, line 652, in CreateFromClass
jni_from_javap = JNIFromJavaP(stdout.split(‘\n’), options)
File “../base/android/jni_generator/jni_generator.py”, line 600, in __init__
signature=JniParams.ParseJavaPSignature(contents[lineno + 1]))]
File “../base/android/jni_generator/jni_generator.py”, line 212, in ParseJavaPSignature
return ‘”%s”‘ % signature_line[signature_line.index(prefix) + len(prefix):]
ValueError: substring not found
make: *** [out/target/product/generic/obj/GYP/shared_intermediates/content/jni/MotionEvent_jni.h] Error 1

その後ソースコードをダウンロードしなおしたところ問題なくビルドできました。